Serious problem in building a AppStore build

nbevansnbevans USMember ✭✭✭
edited July 2017 in Xamarin.iOS

This is a blocker for us. I've searched the web but there are no solutions for this and it seems I'm the first to encounter this issue in the entire Xamarin ecosystem. Any ideas?

1>------ Rebuild All started: Project: Singapore.Ssp.Apple, Configuration: AppStore iPhone ------
1>  Connecting to Mac server 10.211.55.2...
1>  C:\Program Files (x86)\Microsoft SDKs\F#\4.0\Framework\v4.0\fsc.exe -o:obj\iPhone\AppStore\Singapore.Ssp.Apple.exe -g --debug:pdbonly --noframework --define:__UNIFIED__ --define:__MOBILE__ --define:__IOS__ --define:__MOBILE__ --define:__IOS__ --optimize+ -r:"C:\Program Files (x86)\Reference Assemblies\Microsoft\Framework\Xamarin.iOS\v1.0\System.Core.dll" -r:"C:\Program Files (x86)\Reference Assemblies\Microsoft\Framework\Xamarin.iOS\v1.0\System.dll" -r:"C:\Program Files (x86)\Reference Assemblies\Microsoft\Framework\Xamarin.iOS\v1.0\System.Xml.dll" -r:"C:\Program Files (x86)\Reference Assemblies\Microsoft\Framework\Xamarin.iOS\v1.0\Xamarin.iOS.dll" --target:exe --warnaserror:76 --vserrors --LCID:1033 --utf8output --fullpaths --flaterrors --highentropyva- --sqmsessionguid:82ce5112-289b-48d5-b9d3-935e014ba382 "C:\Users\nbevans\AppData\Local\Temp\Xamarin.iOS,Version=v1.0.AssemblyAttributes.fs" AppDelegate.fs Main.fs 
1>  Singapore.Ssp.Apple -> C:\Sandbox\Singapore\Singapore.Ssp.Apple\bin\iPhone\AppStore\Singapore.Ssp.Apple.exe
1>  Detected signing identity:
1>    Code Signing Key: "iPhone Distribution: xxxx xxxx Ltd. (M6UMYD3385)" (33EF5CE9DF57BEF32037BB837C6B05A828D50BBC)
1>    Provisioning Profile: "xxxx SSPv2" (4d9fc8eb-1a22-4a71-b426-02ff57fc88c5)
1>    Bundle Id: com.xxxx.ssp.yyyy
1>    App Id: M6UMYD3385.com.xxxx.ssp.yyyy
1>  error: cannot parse the debug map for "bin/iPhone/AppStore/Singapore.Ssp.Apple.app/Singapore.Ssp.Apple": No such file or directory
1>C:\Program Files (x86)\MSBuild\Xamarin\iOS\Xamarin.iOS.Common.targets(933,3): error : Tool exited with code: 1. Output: error: cannot parse the debug map for "bin/iPhone/AppStore/Singapore.Ssp.Apple.app/Singapore.Ssp.Apple": No such file or directory
1>
1>Done building project "Singapore.Ssp.Apple.fsproj" -- FAILED.
1>
1>Build FAILED.
========== Rebuild All: 0 succeeded, 1 failed, 0 skipped ==========

Answers

Sign In or Register to comment.