[iOS Release] Could not AOT the assembly

Hi,
i have a problem while building release for iOS. Do any have any hint, what is causing error?

MTOUCH : error MT3001: Could not AOT the assembly '/Users/administrator/myagent/_work/184/s/**************.iOS/obj/iPhone/IOS-Release/mtouch-cache/64/3-Build/System.Text.Json.dll' [/Users/administrator/myagent/_work/184/s/**************.iOS.csproj]
at Xamarin.Bundler.AOTTask.ExecuteAsync () [0x00232] in /Users/builder/jenkins/workspace/xamarin-macios/xamarin-macios/tools/mtouch/BuildTasks.mtouch.cs:256
at Xamarin.Bundler.BuildTask.Execute (Xamarin.Bundler.BuildTasks build_tasks) [0x00368] in /Users/builder/jenkins/workspace/xamarin-macios/xamarin-macios/tools/common/BuildTasks.cs:269
at Xamarin.Bundler.BuildTask.Execute (Xamarin.Bundler.BuildTasks build_tasks) [0x00368] in /Users/builder/jenkins/workspace/xamarin-macios/xamarin-macios/tools/common/BuildTasks.cs:269
at Xamarin.Bundler.BuildTask.Execute (Xamarin.Bundler.BuildTasks build_tasks) [0x000f1] in /Users/builder/jenkins/workspace/xamarin-macios/xamarin-macios/tools/common/BuildTasks.cs:240
at Xamarin.Bundler.BuildTask.Execute (Xamarin.Bundler.BuildTasks build_tasks) [0x00368] in /Users/builder/jenkins/workspace/xamarin-macios/xamarin-macios/tools/common/BuildTasks.cs:269
at Xamarin.Bundler.BuildTasks+<>c__DisplayClass4_0.b__0 () [0x0002e] in /Users/builder/jenkins/workspace/xamarin-macios/xamarin-macios/tools/common/BuildTasks.cs:49
Done Building Project "/Users/administrator/myagent/_work/184/s/**************.iOS.csproj" (default targets) -- FAILED.

Build FAILED.

Tagged:

Best Answer

Answers

Sign In or Register to comment.